Target
Intestinal-type alkaline phosphatase
Ligand
BDBM67326
Substrate
Meas. Tech.
Dose Response confirmation of uHTS inhibitors of Mouse Intestinal Alkaline Phosphatase using Human Intestinal Alkaline Phosphatase
IC50
>100000±n/a nM
Citation
 PubChem, PC Dose Response confirmation of uHTS inhibitors of Mouse Intestinal Alkaline Phosphatase using Human Intestinal Alkaline Phosphatase PubChem Bioassay (2010)[AID] 
Target
Name:
Intestinal-type alkaline phosphatase
Synonyms:
ALPI Intestinal alkaline phosphatase | PPBI_HUMAN
Type:
PROTEIN
Mol. Mass.:
56804.94
Organism:
Homo sapiens (Human)
Description:
ChEMBL_1278525
Residue:
528
  
Inhibitor
Name:
BDBM67326
Synonyms:
2-Oxo-2H-chromene-3-carboxylic acid 2-methoxy-4-(2-nitro-vinyl)-phenyl ester 2-oxo-1-benzopyran-3-carboxylic acid [2-methoxy-4-[(E)-2-nitroethenyl]phenyl] ester SMR000516365 [2-methoxy-4-[(E)-2-nitroethenyl]phenyl] 2-oxochromene-3-carboxylate | cid_1183382
Type:
Small organic molecule
Emp. Form.:
C19H13NO7
Mol. Mass.:
367.309
SMILES:
COc1cc(\C=C\[N+]([O-])=O)ccc1OC(=O)c1cc2ccccc2oc1=O
: