Target
Intestinal-type alkaline phosphatase
Ligand
BDBM76226
Substrate
Meas. Tech.
Dose Response confirmation of uHTS inhibitors of Mouse Intestinal Alkaline Phosphatase using Human Intestinal Alkaline Phosphatase
IC50
>100000±n/a nM
Citation
 PubChem, PC Dose Response confirmation of uHTS inhibitors of Mouse Intestinal Alkaline Phosphatase using Human Intestinal Alkaline Phosphatase PubChem Bioassay (2010)[AID] 
Target
Name:
Intestinal-type alkaline phosphatase
Synonyms:
ALPI Intestinal alkaline phosphatase | PPBI_HUMAN
Type:
PROTEIN
Mol. Mass.:
56804.94
Organism:
Homo sapiens (Human)
Description:
ChEMBL_1278525
Residue:
528
  
Inhibitor
Name:
BDBM76226
Synonyms:
2-[4-[(5E)-5-(2-furfurylidene)-4-keto-2-thioxo-thiazolidin-3-yl]butanoylamino]-5-hydroxy-benzoic acid 2-[4-[(5E)-5-(furan-2-ylmethylidene)-4-oxo-2-sulfanylidene-1,3-thiazolidin-3-yl]butanoylamino]-5-hydroxybenzoic acid MLS001159121 cid_17579079
Type:
Small organic molecule
Emp. Form.:
C19H16N2O6S2
Mol. Mass.:
432.47
SMILES:
OC(=O)c1cc(O)ccc1NC(=O)CCCN1C(=S)S\C(=C\c2ccco2)C1=O
: