Target
Alkaline phosphatase, germ cell type
Ligand
BDBM63549
Substrate
Meas. Tech.
Dose Response confirmation of uHTS activators of Mouse Intestinal Alkaline Phosphatase using Placental Alkaline Phosphatase
EC50
48300±n/a nM
Citation
 PubChem, PC Dose Response confirmation of uHTS activators of Mouse Intestinal Alkaline Phosphatase using Placental Alkaline Phosphatase PubChem Bioassay (2010)[AID] 
Target
Name:
Alkaline phosphatase, germ cell type
Synonyms:
ALPG ALPPL2 PPBN_HUMAN | placental-like alkaline phosphatase preproprotein
Type:
PROTEIN
Mol. Mass.:
57374.31
Organism:
Homo sapiens (Human)
Description:
ChEMBL_29964
Residue:
532
  
Inhibitor
Name:
BDBM63549
Synonyms:
MLS000710930 N,N-dimethyl-4-[(1-methylbenzimidazol-2-yl)diazenyl]aniline cid_2851304 | dimethyl-[4-(1-methylbenzimidazol-2-yl)azophenyl]amine
Type:
Small organic molecule
Emp. Form.:
C16H17N5
Mol. Mass.:
279.3397
SMILES:
CN(C)c1ccc(cc1)\N=N\c1nc2ccccc2n1C
: