Target
Alkaline phosphatase, germ cell type
Ligand
BDBM57870
Substrate
Meas. Tech.
Dose Response confirmation of uHTS activators of Mouse Intestinal Alkaline Phosphatase using Placental Alkaline Phosphatase
EC50
65300±n/a nM
Citation
 PubChem, PC Dose Response confirmation of uHTS activators of Mouse Intestinal Alkaline Phosphatase using Placental Alkaline Phosphatase PubChem Bioassay (2010)[AID] 
Target
Name:
Alkaline phosphatase, germ cell type
Synonyms:
ALPG ALPPL2 PPBN_HUMAN | placental-like alkaline phosphatase preproprotein
Type:
PROTEIN
Mol. Mass.:
57374.31
Organism:
Homo sapiens (Human)
Description:
ChEMBL_29964
Residue:
532
  
Inhibitor
Name:
BDBM57870
Synonyms:
(2Z)-1-ethyl-2-[(1-ethyl-6-methyl-2-quinolin-1-iumyl)methylidene]thieno[3,2-e][1,3]benzothiazole;iodide (2Z)-1-ethyl-2-[(1-ethyl-6-methyl-quinolin-1-ium-2-yl)methylidene]thieno[3,2-e][1,3]benzothiazole;iodide 1-ethyl-2-[(Z)-(1-ethylthieno[3,2-e][1,3]benzothiazol-2(1H)-ylidene)methyl]-6-methylquinolinium SMR000305930 | cid_16193285
Type:
Small organic molecule
Emp. Form.:
C24H23N2S2
Mol. Mass.:
403.582
SMILES:
CCN1\C(Sc2ccc3sccc3c12)=C\c1ccc2cc(C)ccc2[n+]1CC
: