Target
Alkaline phosphatase, germ cell type
Ligand
BDBM76217
Substrate
Meas. Tech.
Dose Response confirmation of uHTS activators of Mouse Intestinal Alkaline Phosphatase using Placental Alkaline Phosphatase
EC50
>100000±n/a nM
Citation
 PubChem, PC Dose Response confirmation of uHTS activators of Mouse Intestinal Alkaline Phosphatase using Placental Alkaline Phosphatase PubChem Bioassay (2010)[AID] 
Target
Name:
Alkaline phosphatase, germ cell type
Synonyms:
ALPG ALPPL2 PPBN_HUMAN | placental-like alkaline phosphatase preproprotein
Type:
PROTEIN
Mol. Mass.:
57374.31
Organism:
Homo sapiens (Human)
Description:
ChEMBL_29964
Residue:
532
  
Inhibitor
Name:
BDBM76217
Synonyms:
MLS001096114 N-(2,5-dimethoxyphenyl)-3-[(2-oxidanylidene-3H-1,3-benzoxazol-6-yl)sulfonylamino]propanamide SMR000631041 | cid_24790986
Type:
Small organic molecule
Emp. Form.:
C18H19N3O7S
Mol. Mass.:
421.424
SMILES:
COc1ccc(OC)c(NC(=O)CCNS(=O)(=O)c2ccc3[nH]c(=O)oc3c2)c1
: