Target
Alkaline phosphatase, germ cell type
Ligand
BDBM76169
Substrate
Meas. Tech.
Dose Response confirmation of uHTS inhibitors of Mouse Intestinal Alkaline Phosphatase using Placental Alkaline Phosphatase
IC50
20500±n/a nM
Citation
 PubChem, PC Dose Response confirmation of uHTS inhibitors of Mouse Intestinal Alkaline Phosphatase using Placental Alkaline Phosphatase PubChem Bioassay (2010)[AID] 
Target
Name:
Alkaline phosphatase, germ cell type
Synonyms:
ALPG ALPPL2 PPBN_HUMAN | placental-like alkaline phosphatase preproprotein
Type:
PROTEIN
Mol. Mass.:
57374.31
Organism:
Homo sapiens (Human)
Description:
ChEMBL_29964
Residue:
532
  
Inhibitor
Name:
BDBM76169
Synonyms:
4-ethoxy-N-[4-hydroxy-3-(1H-1,2,4-triazol-3-ylsulfanyl)phenyl]benzenesulfonamide 4-ethoxy-N-[4-hydroxy-3-(1H-1,2,4-triazol-5-ylthio)phenyl]benzenesulfonamide MLS000549575 cid_7312244
Type:
Small organic molecule
Emp. Form.:
C16H16N4O4S2
Mol. Mass.:
392.453
SMILES:
CCOc1ccc(cc1)S(=O)(=O)Nc1ccc(O)c(Sc2nnc[nH]2)c1
: