Target
Alkaline phosphatase, germ cell type
Ligand
BDBM43797
Substrate
Meas. Tech.
Dose Response confirmation of uHTS inhibitors of Mouse Intestinal Alkaline Phosphatase using Placental Alkaline Phosphatase
IC50
13200±n/a nM
Citation
 PubChem, PC Dose Response confirmation of uHTS inhibitors of Mouse Intestinal Alkaline Phosphatase using Placental Alkaline Phosphatase PubChem Bioassay (2010)[AID] 
Target
Name:
Alkaline phosphatase, germ cell type
Synonyms:
ALPG ALPPL2 PPBN_HUMAN | placental-like alkaline phosphatase preproprotein
Type:
PROTEIN
Mol. Mass.:
57374.31
Organism:
Homo sapiens (Human)
Description:
ChEMBL_29964
Residue:
532
  
Inhibitor
Name:
BDBM43797
Synonyms:
1-[(4-methoxyphenyl)-phenyl-methyl]-3-[2-(3-prop-1-en-2-ylphenyl)propan-2-yl]urea 1-[(4-methoxyphenyl)-phenylmethyl]-3-[2-[3-(1-methylethenyl)phenyl]propan-2-yl]urea MLS-0214623.0001 | cid_2901383
Type:
Small organic molecule
Emp. Form.:
C27H30N2O2
Mol. Mass.:
414.5393
SMILES:
COc1ccc(cc1)C(NC(=O)NC(C)(C)c1cccc(c1)C(C)=C)c1ccccc1
: