Target
Alkaline phosphatase, germ cell type
Ligand
BDBM61893
Substrate
Meas. Tech.
Dose Response confirmation of uHTS inhibitors of Mouse Intestinal Alkaline Phosphatase using Placental Alkaline Phosphatase
IC50
>100000±n/a nM
Citation
 PubChem, PC Dose Response confirmation of uHTS inhibitors of Mouse Intestinal Alkaline Phosphatase using Placental Alkaline Phosphatase PubChem Bioassay (2010)[AID] 
Target
Name:
Alkaline phosphatase, germ cell type
Synonyms:
ALPG ALPPL2 PPBN_HUMAN | placental-like alkaline phosphatase preproprotein
Type:
PROTEIN
Mol. Mass.:
57374.31
Organism:
Homo sapiens (Human)
Description:
ChEMBL_29964
Residue:
532
  
Inhibitor
Name:
BDBM61893
Synonyms:
3,4-dimethoxybenzoic acid [2-[(5-nitro-2-thiazolyl)amino]-2-oxoethyl] ester MLS002171548 [2-[(5-nitro-1,3-thiazol-2-yl)amino]-2-oxidanylidene-ethyl] 3,4-dimethoxybenzoate cid_16329946
Type:
Small organic molecule
Emp. Form.:
C14H13N3O7S
Mol. Mass.:
367.334
SMILES:
COc1ccc(cc1OC)C(=O)OCC(=O)Nc1ncc(s1)[N+]([O-])=O
: