Target
Alkaline phosphatase, tissue-nonspecific isozyme
Ligand
BDBM52228
Substrate
Meas. Tech.
Dose Response confirmation of uHTS activators of Mouse Intestinal Alkaline Phosphatase using Tissue Nonspecific Alkaline Phosphatase.
EC50
62800±n/a nM
Citation
 PubChem, PC Dose Response confirmation of uHTS activators of Mouse Intestinal Alkaline Phosphatase using Tissue Nonspecific Alkaline Phosphatase. PubChem Bioassay (2010)[AID] 
Target
Name:
Alkaline phosphatase, tissue-nonspecific isozyme
Synonyms:
ALPL tissue-nonspecific alkaline phosphatase precursor
Type:
PROTEIN
Mol. Mass.:
57306.17
Organism:
Homo sapiens (Human)
Description:
ChEMBL_1448917
Residue:
524
  
Inhibitor
Name:
BDBM52228
Synonyms:
4-methoxy-N-[4-oxidanyl-3-(1H-1,2,4-triazol-5-ylsulfanyl)phenyl]benzenesulfonamide N-[4-Hydroxy-3-(1H-[1,2,4]triazol-3-ylsulfanyl)-phenyl]-4-methoxy-benzenesulfonamide N-[4-hydroxy-3-(1H-1,2,4-triazol-5-ylthio)phenyl]-4-methoxy-benzenesulfonamide SMR000124977 | cid_2207660
Type:
Small organic molecule
Emp. Form.:
C15H14N4O4S2
Mol. Mass.:
378.426
SMILES:
COc1ccc(cc1)S(=O)(=O)Nc1ccc(O)c(Sc2nnc[nH]2)c1
: