Target
Alkaline phosphatase, tissue-nonspecific isozyme
Ligand
BDBM60889
Substrate
Meas. Tech.
Dose Response confirmation of uHTS activators of Mouse Intestinal Alkaline Phosphatase using Tissue Nonspecific Alkaline Phosphatase.
EC50
24100±n/a nM
Citation
 PubChem, PC Dose Response confirmation of uHTS activators of Mouse Intestinal Alkaline Phosphatase using Tissue Nonspecific Alkaline Phosphatase. PubChem Bioassay (2010)[AID] 
Target
Name:
Alkaline phosphatase, tissue-nonspecific isozyme
Synonyms:
ALPL tissue-nonspecific alkaline phosphatase precursor
Type:
PROTEIN
Mol. Mass.:
57306.17
Organism:
Homo sapiens (Human)
Description:
ChEMBL_1448917
Residue:
524
  
Inhibitor
Name:
BDBM60889
Synonyms:
2-[(5E)-5-(3,4-dihydroxybenzylidene)-4-keto-2-thioxo-thiazolidin-3-yl]-2-phenyl-acetic acid 2-[(5E)-5-[(3,4-dihydroxyphenyl)methylidene]-4-oxo-2-sulfanylidene-3-thiazolidinyl]-2-phenylacetic acid MLS001216254 cid_6227326
Type:
Small organic molecule
Emp. Form.:
C18H13NO5S2
Mol. Mass.:
387.43
SMILES:
OC(=O)C(N1C(=S)S\C(=C\c2ccc(O)c(O)c2)C1=O)c1ccccc1
: