Target
Alkaline phosphatase, tissue-nonspecific isozyme
Ligand
BDBM51017
Substrate
Meas. Tech.
Dose Response confirmation of uHTS inhibitors of Human Intestinal Alkaline Phosphatase using Tissue Nonspecific Alkaline Phosphatase.
IC50
8190±n/a nM
Citation
 PubChem, PC Dose Response confirmation of uHTS inhibitors of Human Intestinal Alkaline Phosphatase using Tissue Nonspecific Alkaline Phosphatase. PubChem Bioassay (2010)[AID] 
Target
Name:
Alkaline phosphatase, tissue-nonspecific isozyme
Synonyms:
ALPL tissue-nonspecific alkaline phosphatase precursor
Type:
PROTEIN
Mol. Mass.:
57306.17
Organism:
Homo sapiens (Human)
Description:
ChEMBL_1448917
Residue:
524
  
Inhibitor
Name:
BDBM51017
Synonyms:
(5E)-3-allyl-2-thioxo-5-[(2E)-2-(1,3,3-trimethyl-1,3-dihydro-2H-indol-2-ylidene)ethylidene]-1,3-thiazolidin-4-one (5E)-3-prop-2-enyl-2-sulfanylidene-5-[(2E)-2-(1,3,3-trimethyl-2-indolylidene)ethylidene]-4-thiazolidinone MLS000584397 cid_12005182
Type:
Small organic molecule
Emp. Form.:
C19H20N2OS2
Mol. Mass.:
356.505
SMILES:
CN1\C(=C\C=C2\SC(=S)N(CC=C)C2=O)C(C)(C)c2ccccc12
: