Target
Alkaline phosphatase, tissue-nonspecific isozyme
Ligand
BDBM75758
Substrate
Meas. Tech.
Dose Response confirmation of uHTS inhibitors of Human Intestinal Alkaline Phosphatase using Tissue Nonspecific Alkaline Phosphatase.
IC50
>100000±n/a nM
Citation
 PubChem, PC Dose Response confirmation of uHTS inhibitors of Human Intestinal Alkaline Phosphatase using Tissue Nonspecific Alkaline Phosphatase. PubChem Bioassay (2010)[AID] 
Target
Name:
Alkaline phosphatase, tissue-nonspecific isozyme
Synonyms:
ALPL tissue-nonspecific alkaline phosphatase precursor
Type:
PROTEIN
Mol. Mass.:
57306.17
Organism:
Homo sapiens (Human)
Description:
ChEMBL_1448917
Residue:
524
  
Inhibitor
Name:
BDBM75758
Synonyms:
(1Z)-1-(4-nitrophenyl)ethanone (2-nitrophenyl)hydrazone 2-nitro-N-[1-(4-nitrophenyl)ethylideneamino]aniline SMR000554568 | cid_3742591
Type:
Small organic molecule
Emp. Form.:
C14H12N4O4
Mol. Mass.:
300.2695
SMILES:
CC(N=Nc1ccccc1[N+]([O-])=O)c1ccc(cc1)[N+]([O-])=O
: