Target
DNA (cytosine-5)-methyltransferase 3A
Ligand
BDBM51783
Substrate
Meas. Tech.
SAR Selectivity Analysis of small molecule inhibitors of PEST using pCAP in a fluorescence assay
IC50
2030±n/a nM
Citation
 PubChem, PC SAR Selectivity Analysis of small molecule inhibitors of PEST using pCAP in a fluorescence assay PubChem Bioassay (2010)[AID] 
Target
Name:
DNA (cytosine-5)-methyltransferase 3A
Synonyms:
DNA (cytosine-5)-methyltransferase 3A DNA methyltransferase HsaIIIA DNMT3A M.HsaIIIA | tyrosine-protein phosphatase non-receptor type 12 isoform 2
Type:
PROTEIN
Mol. Mass.:
101857.24
Organism:
Homo sapiens (Human)
Description:
ChEMBL_1510405
Residue:
912
  
Inhibitor
Name:
BDBM51783
Synonyms:
3-[(5E)-5-[1-(2-chlorobenzyl)-2-keto-indolin-3-ylidene]-4-keto-2-thioxo-thiazolidin-3-yl]propionic acid 3-[(5E)-5-[1-[(2-chlorophenyl)methyl]-2-oxo-3-indolylidene]-4-oxo-2-sulfanylidene-3-thiazolidinyl]propanoic acid MLS001173336 cid_1570081
Type:
Small organic molecule
Emp. Form.:
C21H15ClN2O4S2
Mol. Mass.:
458.938
SMILES:
OC(=O)CCN1C(=S)S\C(C1=O)=C1\C(=O)N(Cc2ccccc2Cl)c2ccccc12
: