Target
DNA (cytosine-5)-methyltransferase 3A
Ligand
BDBM46236
Substrate
Meas. Tech.
SAR Selectivity Analysis of small molecule inhibitors of PEST using pCAP in a fluorescence assay
IC50
2360±n/a nM
Citation
 PubChem, PC SAR Selectivity Analysis of small molecule inhibitors of PEST using pCAP in a fluorescence assay PubChem Bioassay (2010)[AID] 
Target
Name:
DNA (cytosine-5)-methyltransferase 3A
Synonyms:
DNA (cytosine-5)-methyltransferase 3A DNA methyltransferase HsaIIIA DNMT3A M.HsaIIIA | tyrosine-protein phosphatase non-receptor type 12 isoform 2
Type:
PROTEIN
Mol. Mass.:
101857.24
Organism:
Homo sapiens (Human)
Description:
ChEMBL_1510405
Residue:
912
  
Inhibitor
Name:
BDBM46236
Synonyms:
4-[8-[(3-chloranyl-2-methyl-phenyl)sulfamoyl]-3a,4,5,9b-tetrahydro-3H-cyclopenta[c]quinolin-4-yl]benzoic acid 4-[8-[(3-chloro-2-methylphenyl)sulfamoyl]-3a,4,5,9b-tetrahydro-3H-cyclopenta[c]quinolin-4-yl]benzoic acid cid_2975144
Type:
Small organic molecule
Emp. Form.:
C26H23ClN2O4S
Mol. Mass.:
494.99
SMILES:
Cc1c(Cl)cccc1NS(=O)(=O)c1ccc2NC(C3CC=CC3c2c1)c1ccc(cc1)C(O)=O
: