Target
DNA (cytosine-5)-methyltransferase 3A
Ligand
BDBM46238
Substrate
Meas. Tech.
SAR Selectivity Analysis of small molecule inhibitors of PEST using pCAP in a fluorescence assay
IC50
17000±n/a nM
Citation
 PubChem, PC SAR Selectivity Analysis of small molecule inhibitors of PEST using pCAP in a fluorescence assay PubChem Bioassay (2010)[AID] 
Target
Name:
DNA (cytosine-5)-methyltransferase 3A
Synonyms:
DNA (cytosine-5)-methyltransferase 3A DNA methyltransferase HsaIIIA DNMT3A M.HsaIIIA | tyrosine-protein phosphatase non-receptor type 12 isoform 2
Type:
PROTEIN
Mol. Mass.:
101857.24
Organism:
Homo sapiens (Human)
Description:
ChEMBL_1510405
Residue:
912
  
Inhibitor
Name:
BDBM46238
Synonyms:
3-[[2-chloranyl-4-[(E)-2-cyano-2-(3-fluorophenyl)ethenyl]phenoxy]methyl]benzoic acid 3-[[2-chloro-4-[(E)-2-cyano-2-(3-fluorophenyl)vinyl]phenoxy]methyl]benzoic acid cid_2226406
Type:
Small organic molecule
Emp. Form.:
C23H15ClFNO3
Mol. Mass.:
407.822
SMILES:
OC(=O)c1cccc(COc2ccc(\C=C(\C#N)c3cccc(F)c3)cc2Cl)c1
: