Target
DNA (cytosine-5)-methyltransferase 3A
Ligand
BDBM46264
Substrate
Meas. Tech.
SAR Selectivity Analysis of small molecule inhibitors of PEST using pCAP in a fluorescence assay
IC50
89200±n/a nM
Citation
 PubChem, PC SAR Selectivity Analysis of small molecule inhibitors of PEST using pCAP in a fluorescence assay PubChem Bioassay (2010)[AID] 
Target
Name:
DNA (cytosine-5)-methyltransferase 3A
Synonyms:
DNA (cytosine-5)-methyltransferase 3A DNA methyltransferase HsaIIIA DNMT3A M.HsaIIIA | tyrosine-protein phosphatase non-receptor type 12 isoform 2
Type:
PROTEIN
Mol. Mass.:
101857.24
Organism:
Homo sapiens (Human)
Description:
ChEMBL_1510405
Residue:
912
  
Inhibitor
Name:
BDBM46264
Synonyms:
3-[2-azaspiro[5.5]undecan-2-yl-(1-cyclopentyl-1,2,3,4-tetrazol-5-yl)methyl]-6-methyl-1H-quinolin-2-one 3-[2-azaspiro[5.5]undecan-2-yl-(1-cyclopentyltetrazol-5-yl)methyl]-6-methyl-1H-quinolin-2-one MLS-0412204.0001 | cid_3182456
Type:
Small organic molecule
Emp. Form.:
C27H36N6O
Mol. Mass.:
460.6143
SMILES:
Cc1ccc2[nH]c(=O)c(cc2c1)C(N1CCCC2(CCCCC2)C1)c1nnnn1C1CCCC1
: