Target
DNA (cytosine-5)-methyltransferase 3A
Ligand
BDBM46280
Substrate
Meas. Tech.
SAR Selectivity Analysis of small molecule inhibitors of PEST using pCAP in a fluorescence assay
IC50
12600±n/a nM
Citation
 PubChem, PC SAR Selectivity Analysis of small molecule inhibitors of PEST using pCAP in a fluorescence assay PubChem Bioassay (2010)[AID] 
Target
Name:
DNA (cytosine-5)-methyltransferase 3A
Synonyms:
DNA (cytosine-5)-methyltransferase 3A DNA methyltransferase HsaIIIA DNMT3A M.HsaIIIA | tyrosine-protein phosphatase non-receptor type 12 isoform 2
Type:
PROTEIN
Mol. Mass.:
101857.24
Organism:
Homo sapiens (Human)
Description:
ChEMBL_1510405
Residue:
912
  
Inhibitor
Name:
BDBM46280
Synonyms:
2-[4-[(Z)-[2-(4-ethylanilino)-4-keto-2-thiazolin-5-ylidene]methyl]phenoxy]acetic acid 2-[4-[(Z)-[2-(4-ethylanilino)-4-oxo-5-thiazolylidene]methyl]phenoxy]acetic acid MLS-0425605.0001 | cid_5765582
Type:
Small organic molecule
Emp. Form.:
C20H18N2O4S
Mol. Mass.:
382.433
SMILES:
CCc1ccc(NC2=NC(=O)C(S2)=Cc2ccc(OCC(O)=O)cc2)cc1
: