Target
DNA (cytosine-5)-methyltransferase 3A
Ligand
BDBM64829
Substrate
Meas. Tech.
SAR Selectivity Analysis of small molecule inhibitors of PEST using pCAP in a fluorescence assay
IC50
39400±n/a nM
Citation
 PubChem, PC SAR Selectivity Analysis of small molecule inhibitors of PEST using pCAP in a fluorescence assay PubChem Bioassay (2010)[AID] 
Target
Name:
DNA (cytosine-5)-methyltransferase 3A
Synonyms:
DNA (cytosine-5)-methyltransferase 3A DNA methyltransferase HsaIIIA DNMT3A M.HsaIIIA | tyrosine-protein phosphatase non-receptor type 12 isoform 2
Type:
PROTEIN
Mol. Mass.:
101857.24
Organism:
Homo sapiens (Human)
Description:
ChEMBL_1510405
Residue:
912
  
Inhibitor
Name:
BDBM64829
Synonyms:
2-hydroxy-4-[4-[(5Z)-4-keto-5-piperonylidene-2-thioxo-thiazolidin-3-yl]butanoylamino]benzoic acid 4-[4-[(5Z)-5-(1,3-benzodioxol-5-ylmethylidene)-4-oxo-2-sulfanylidene-1,3-thiazolidin-3-yl]butanoylamino]-2-hydroxybenzoic acid MLS-0435438.0001 | cid_6203183
Type:
Small organic molecule
Emp. Form.:
C22H18N2O7S2
Mol. Mass.:
486.518
SMILES:
OC(=O)c1ccc(NC(=O)CCCN2C(=S)S\C(=C/c3ccc4OCOc4c3)C2=O)cc1O
: