Target
Alkaline phosphatase, tissue-nonspecific isozyme
Ligand
BDBM75614
Substrate
Meas. Tech.
Dose Response confirmation of uHTS activators of Human Intestinal Alkaline Phosphatase using Tissue Nonspecific Alkaline Phosphatase.
EC50
26100±n/a nM
Citation
 PubChem, PC Dose Response confirmation of uHTS activators of Human Intestinal Alkaline Phosphatase using Tissue Nonspecific Alkaline Phosphatase. PubChem Bioassay (2010)[AID] 
Target
Name:
Alkaline phosphatase, tissue-nonspecific isozyme
Synonyms:
ALPL tissue-nonspecific alkaline phosphatase precursor
Type:
PROTEIN
Mol. Mass.:
57306.17
Organism:
Homo sapiens (Human)
Description:
ChEMBL_1448917
Residue:
524
  
Inhibitor
Name:
BDBM75614
Synonyms:
2-(4-Methyl-quinazolin-2-ylamino)-1,5,6,7-tetrahydro-cyclopentapyrimidin-4-one 2-[(4-methylquinazolin-2-yl)amino]-1,5,6,7-tetrahydrocyclopenta[d]pyrimidin-4-one SMR000123397 | cid_707169
Type:
Small organic molecule
Emp. Form.:
C16H15N5O
Mol. Mass.:
293.3232
SMILES:
Cc1nc(Nc2nc3CCCc3c(=O)[nH]2)nc2ccccc12
: