Target
Alkaline phosphatase, tissue-nonspecific isozyme
Ligand
BDBM51349
Substrate
Meas. Tech.
Dose Response confirmation of uHTS activators of Human Intestinal Alkaline Phosphatase using Tissue Nonspecific Alkaline Phosphatase.
EC50
14100±n/a nM
Citation
 PubChem, PC Dose Response confirmation of uHTS activators of Human Intestinal Alkaline Phosphatase using Tissue Nonspecific Alkaline Phosphatase. PubChem Bioassay (2010)[AID] 
Target
Name:
Alkaline phosphatase, tissue-nonspecific isozyme
Synonyms:
ALPL tissue-nonspecific alkaline phosphatase precursor
Type:
PROTEIN
Mol. Mass.:
57306.17
Organism:
Homo sapiens (Human)
Description:
ChEMBL_1448917
Residue:
524
  
Inhibitor
Name:
BDBM51349
Synonyms:
2-(8-amino-9H-[1,2,4]triazolo[1,5-d][1,2,4]triazepin-5-yl)-5-(4-methoxyphenyl)-3-(trifluoromethyl)-2-pyrazolin-3-ol 2-(8-azanyl-9H-[1,2,4]triazolo[1,5-d][1,2,4]triazepin-5-yl)-5-(4-methoxyphenyl)-3-(trifluoromethyl)-4H-pyrazol-3-ol SMR000290221 | cid_4095928
Type:
Small organic molecule
Emp. Form.:
C16H15F3N8O2
Mol. Mass.:
408.3379
SMILES:
COc1ccc(cc1)C1=NN(C2=NN=C(N)Cc3ncnn23)C(O)(C1)C(F)(F)F
: