Target
Alkaline phosphatase, tissue-nonspecific isozyme
Ligand
BDBM75659
Substrate
Meas. Tech.
Dose Response confirmation of uHTS activators of Human Intestinal Alkaline Phosphatase using Tissue Nonspecific Alkaline Phosphatase.
EC50
26300±n/a nM
Citation
 PubChem, PC Dose Response confirmation of uHTS activators of Human Intestinal Alkaline Phosphatase using Tissue Nonspecific Alkaline Phosphatase. PubChem Bioassay (2010)[AID] 
Target
Name:
Alkaline phosphatase, tissue-nonspecific isozyme
Synonyms:
ALPL tissue-nonspecific alkaline phosphatase precursor
Type:
PROTEIN
Mol. Mass.:
57306.17
Organism:
Homo sapiens (Human)
Description:
ChEMBL_1448917
Residue:
524
  
Inhibitor
Name:
BDBM75659
Synonyms:
1-[[(E)-(3-methoxy-6-oxidanylidene-cyclohexa-2,4-dien-1-ylidene)methyl]amino]-3-(2-phenylethyl)thiourea 1-[[(E)-(3-methoxy-6-oxocyclohexa-2,4-dien-1-ylidene)methyl]amino]-3-(2-phenylethyl)thiourea MLS001171019 cid_6508339
Type:
Small organic molecule
Emp. Form.:
C17H19N3O2S
Mol. Mass.:
329.417
SMILES:
COc1ccc(O)c(C=NNC(=S)NCCc2ccccc2)c1
: