Target
Alkaline phosphatase, tissue-nonspecific isozyme
Ligand
BDBM75664
Substrate
Meas. Tech.
Dose Response confirmation of uHTS activators of Human Intestinal Alkaline Phosphatase using Tissue Nonspecific Alkaline Phosphatase.
EC50
75800±n/a nM
Citation
 PubChem, PC Dose Response confirmation of uHTS activators of Human Intestinal Alkaline Phosphatase using Tissue Nonspecific Alkaline Phosphatase. PubChem Bioassay (2010)[AID] 
Target
Name:
Alkaline phosphatase, tissue-nonspecific isozyme
Synonyms:
ALPL tissue-nonspecific alkaline phosphatase precursor
Type:
PROTEIN
Mol. Mass.:
57306.17
Organism:
Homo sapiens (Human)
Description:
ChEMBL_1448917
Residue:
524
  
Inhibitor
Name:
BDBM75664
Synonyms:
MLS001083067 N-[2-[1-[(2-methoxyphenyl)methyl]-4-piperidinyl]-3-pyrazolyl]-4-phenylbutanamide N-[2-[1-[(2-methoxyphenyl)methyl]piperidin-4-yl]pyrazol-3-yl]-4-phenylbutanamide cid_24790576
Type:
Small organic molecule
Emp. Form.:
C26H32N4O2
Mol. Mass.:
432.5579
SMILES:
COc1ccccc1CN1CCC(CC1)n1nccc1NC(=O)CCCc1ccccc1
: