Target
Alkaline phosphatase, tissue-nonspecific isozyme
Ligand
BDBM51928
Substrate
Meas. Tech.
Dose Response confirmation of uHTS activators of Human Intestinal Alkaline Phosphatase using Tissue Nonspecific Alkaline Phosphatase.
EC50
66100±n/a nM
Citation
 PubChem, PC Dose Response confirmation of uHTS activators of Human Intestinal Alkaline Phosphatase using Tissue Nonspecific Alkaline Phosphatase. PubChem Bioassay (2010)[AID] 
Target
Name:
Alkaline phosphatase, tissue-nonspecific isozyme
Synonyms:
ALPL tissue-nonspecific alkaline phosphatase precursor
Type:
PROTEIN
Mol. Mass.:
57306.17
Organism:
Homo sapiens (Human)
Description:
ChEMBL_1448917
Residue:
524
  
Inhibitor
Name:
BDBM51928
Synonyms:
MLS001090557 N-[3-(3-chlorophenyl)phenyl]-1-[(1-propan-2-yl-4-pyrazolyl)methyl]-4-piperidinecarboxamide SMR000664674 | cid_24790786
Type:
Small organic molecule
Emp. Form.:
C25H29ClN4O
Mol. Mass.:
436.977
SMILES:
CC(C)n1cc(CN2CCC(CC2)C(=O)Nc2cccc(c2)-c2cccc(Cl)c2)cn1
: