Target
Alkaline phosphatase, tissue-nonspecific isozyme
Ligand
BDBM75670
Substrate
Meas. Tech.
Dose Response confirmation of uHTS activators of Human Intestinal Alkaline Phosphatase using Tissue Nonspecific Alkaline Phosphatase.
EC50
76200±n/a nM
Citation
 PubChem, PC Dose Response confirmation of uHTS activators of Human Intestinal Alkaline Phosphatase using Tissue Nonspecific Alkaline Phosphatase. PubChem Bioassay (2010)[AID] 
Target
Name:
Alkaline phosphatase, tissue-nonspecific isozyme
Synonyms:
ALPL tissue-nonspecific alkaline phosphatase precursor
Type:
PROTEIN
Mol. Mass.:
57306.17
Organism:
Homo sapiens (Human)
Description:
ChEMBL_1448917
Residue:
524
  
Inhibitor
Name:
BDBM75670
Synonyms:
2-(N-(3,5-dimethylisoxazol-4-yl)sulfonyl-4-methyl-anilino)-N-o-anisyl-acetamide 2-[N-[(3,5-dimethyl-1,2-oxazol-4-yl)sulfonyl]-4-methylanilino]-N-[(2-methoxyphenyl)methyl]acetamide MLS000912891 cid_16020025
Type:
Small organic molecule
Emp. Form.:
C22H25N3O5S
Mol. Mass.:
443.516
SMILES:
COc1ccccc1CNC(=O)CN(c1ccc(C)cc1)S(=O)(=O)c1c(C)noc1C
: