Target
Alkaline phosphatase, tissue-nonspecific isozyme
Ligand
BDBM65665
Substrate
Meas. Tech.
Dose Response confirmation of uHTS activators of Human Intestinal Alkaline Phosphatase using Tissue Nonspecific Alkaline Phosphatase.
EC50
16100±n/a nM
Citation
 PubChem, PC Dose Response confirmation of uHTS activators of Human Intestinal Alkaline Phosphatase using Tissue Nonspecific Alkaline Phosphatase. PubChem Bioassay (2010)[AID] 
Target
Name:
Alkaline phosphatase, tissue-nonspecific isozyme
Synonyms:
ALPL tissue-nonspecific alkaline phosphatase precursor
Type:
PROTEIN
Mol. Mass.:
57306.17
Organism:
Homo sapiens (Human)
Description:
ChEMBL_1448917
Residue:
524
  
Inhibitor
Name:
BDBM65665
Synonyms:
1-[(2-bromobenzoyl)amino]-3-cyclohexyl-thiourea 1-[(2-bromophenyl)carbonylamino]-3-cyclohexyl-thiourea MLS001075515 cid_1929796
Type:
Small organic molecule
Emp. Form.:
C14H18BrN3OS
Mol. Mass.:
356.281
SMILES:
Brc1ccccc1C(=O)NNC(=S)NC1CCCCC1
: