Target
Alkaline phosphatase, tissue-nonspecific isozyme
Ligand
BDBM75692
Substrate
Meas. Tech.
Dose Response confirmation of uHTS activators of Human Intestinal Alkaline Phosphatase using Tissue Nonspecific Alkaline Phosphatase.
EC50
7580±n/a nM
Citation
 PubChem, PC Dose Response confirmation of uHTS activators of Human Intestinal Alkaline Phosphatase using Tissue Nonspecific Alkaline Phosphatase. PubChem Bioassay (2010)[AID] 
Target
Name:
Alkaline phosphatase, tissue-nonspecific isozyme
Synonyms:
ALPL tissue-nonspecific alkaline phosphatase precursor
Type:
PROTEIN
Mol. Mass.:
57306.17
Organism:
Homo sapiens (Human)
Description:
ChEMBL_1448917
Residue:
524
  
Inhibitor
Name:
BDBM75692
Synonyms:
MLS001235951 N'-[1-(3-methylphenyl)pyrazolo[3,4-d]pyrimidin-4-yl]furan-2-carbohydrazide SMR000807172 | cid_8489109
Type:
Small organic molecule
Emp. Form.:
C17H14N6O2
Mol. Mass.:
334.3321
SMILES:
Cc1cccc(c1)-n1ncc2c(NNC(=O)c3ccco3)ncnc12
: