Target
Alkaline phosphatase, germ cell type
Ligand
BDBM65289
Substrate
Meas. Tech.
Dose Response confirmation of uHTS activators of Human Intestinal Alkaline Phosphatase using Placental Alkaline Phosphatase
EC50
12700±n/a nM
Citation
 PubChem, PC Dose Response confirmation of uHTS activators of Human Intestinal Alkaline Phosphatase using Placental Alkaline Phosphatase PubChem Bioassay (2010)[AID] 
Target
Name:
Alkaline phosphatase, germ cell type
Synonyms:
ALPG ALPPL2 PPBN_HUMAN | placental-like alkaline phosphatase preproprotein
Type:
PROTEIN
Mol. Mass.:
57374.31
Organism:
Homo sapiens (Human)
Description:
ChEMBL_29964
Residue:
532
  
Inhibitor
Name:
BDBM65289
Synonyms:
(E)-N-[(salicyloylamino)thiocarbamoyl]-3-(2-thienyl)acrylamide (E)-N-[[(2-hydroxyphenyl)carbonylamino]carbamothioyl]-3-thiophen-2-yl-prop-2-enamide MLS000703259 cid_5763840
Type:
Small organic molecule
Emp. Form.:
C15H13N3O3S2
Mol. Mass.:
347.412
SMILES:
Oc1ccccc1C(=O)NNC(=S)NC(=O)\C=C\c1cccs1
: