Target
Alkaline phosphatase, germ cell type
Ligand
BDBM60205
Substrate
Meas. Tech.
Dose Response confirmation of uHTS activators of Human Intestinal Alkaline Phosphatase using Placental Alkaline Phosphatase
EC50
14500±n/a nM
Citation
 PubChem, PC Dose Response confirmation of uHTS activators of Human Intestinal Alkaline Phosphatase using Placental Alkaline Phosphatase PubChem Bioassay (2010)[AID] 
Target
Name:
Alkaline phosphatase, germ cell type
Synonyms:
ALPG ALPPL2 PPBN_HUMAN | placental-like alkaline phosphatase preproprotein
Type:
PROTEIN
Mol. Mass.:
57374.31
Organism:
Homo sapiens (Human)
Description:
ChEMBL_29964
Residue:
532
  
Inhibitor
Name:
BDBM60205
Synonyms:
MLS001006819 N,N'-bis(4-oxidanylidene-2-sulfanylidene-1,3-thiazolidin-3-yl)ethanediamide N,N'-bis(4-oxo-2-sulfanylidene-3-thiazolidinyl)oxamide cid_2355982
Type:
Small organic molecule
Emp. Form.:
C8H6N4O4S4
Mol. Mass.:
350.418
SMILES:
Oc1csc(=S)n1NC(=O)C(=O)Nn1c(O)csc1=S
: