Target
Alkaline phosphatase, germ cell type
Ligand
BDBM75658
Substrate
Meas. Tech.
Dose Response confirmation of uHTS activators of Human Intestinal Alkaline Phosphatase using Placental Alkaline Phosphatase
EC50
10500±n/a nM
Citation
 PubChem, PC Dose Response confirmation of uHTS activators of Human Intestinal Alkaline Phosphatase using Placental Alkaline Phosphatase PubChem Bioassay (2010)[AID] 
Target
Name:
Alkaline phosphatase, germ cell type
Synonyms:
ALPG ALPPL2 PPBN_HUMAN | placental-like alkaline phosphatase preproprotein
Type:
PROTEIN
Mol. Mass.:
57374.31
Organism:
Homo sapiens (Human)
Description:
ChEMBL_29964
Residue:
532
  
Inhibitor
Name:
BDBM75658
Synonyms:
1,2-bis(6-fluoranyl-1H-benzimidazol-2-yl)ethane-1,2-diol MLS001182368 cid_2747081
Type:
Small organic molecule
Emp. Form.:
C16H12F2N4O2
Mol. Mass.:
330.2889
SMILES:
OC(C(O)c1nc2ccc(F)cc2[nH]1)c1nc2ccc(F)cc2[nH]1
: