Target
Alkaline phosphatase, germ cell type
Ligand
BDBM75677
Substrate
Meas. Tech.
Dose Response confirmation of uHTS activators of Human Intestinal Alkaline Phosphatase using Placental Alkaline Phosphatase
EC50
13700±n/a nM
Citation
 PubChem, PC Dose Response confirmation of uHTS activators of Human Intestinal Alkaline Phosphatase using Placental Alkaline Phosphatase PubChem Bioassay (2010)[AID] 
Target
Name:
Alkaline phosphatase, germ cell type
Synonyms:
ALPG ALPPL2 PPBN_HUMAN | placental-like alkaline phosphatase preproprotein
Type:
PROTEIN
Mol. Mass.:
57374.31
Organism:
Homo sapiens (Human)
Description:
ChEMBL_29964
Residue:
532
  
Inhibitor
Name:
BDBM75677
Synonyms:
1-[(2-bromobenzoyl)amino]-3-(2-furfuryl)thiourea 1-[(2-bromophenyl)carbonylamino]-3-(furan-2-ylmethyl)thiourea MLS001123862 cid_1965046
Type:
Small organic molecule
Emp. Form.:
C13H12BrN3O2S
Mol. Mass.:
354.222
SMILES:
Brc1ccccc1C(=O)NNC(=S)NCc1ccco1
: