Target
Alkaline phosphatase, germ cell type
Ligand
BDBM43817
Substrate
Meas. Tech.
Dose Response confirmation of uHTS activators of Human Intestinal Alkaline Phosphatase using Placental Alkaline Phosphatase
EC50
663±n/a nM
Citation
 PubChem, PC Dose Response confirmation of uHTS activators of Human Intestinal Alkaline Phosphatase using Placental Alkaline Phosphatase PubChem Bioassay (2010)[AID] 
Target
Name:
Alkaline phosphatase, germ cell type
Synonyms:
ALPG ALPPL2 PPBN_HUMAN | placental-like alkaline phosphatase preproprotein
Type:
PROTEIN
Mol. Mass.:
57374.31
Organism:
Homo sapiens (Human)
Description:
ChEMBL_29964
Residue:
532
  
Inhibitor
Name:
BDBM43817
Synonyms:
(3Z)-1-allyl-3-[(2-hydroxyphenyl)hydrazono]oxindole (3Z)-3-[(2-hydroxyphenyl)hydrazinylidene]-1-prop-2-enyl-indol-2-one ML087 cid_25199559
Type:
Small organic molecule
Emp. Form.:
C17H15N3O2
Mol. Mass.:
293.3199
SMILES:
Oc1ccccc1NN=C1C(=O)N(CC=C)c2ccccc12
: