Target
Alkaline phosphatase, germ cell type
Ligand
BDBM39767
Substrate
Meas. Tech.
Dose Response confirmation of uHTS inhibitors of Human Intestinal Alkaline Phosphatase using Placental Alkaline Phosphatase
IC50
37800±n/a nM
Citation
 PubChem, PC Dose Response confirmation of uHTS inhibitors of Human Intestinal Alkaline Phosphatase using Placental Alkaline Phosphatase PubChem Bioassay (2010)[AID] 
Target
Name:
Alkaline phosphatase, germ cell type
Synonyms:
ALPG ALPPL2 PPBN_HUMAN | placental-like alkaline phosphatase preproprotein
Type:
PROTEIN
Mol. Mass.:
57374.31
Organism:
Homo sapiens (Human)
Description:
ChEMBL_29964
Residue:
532
  
Inhibitor
Name:
BDBM39767
Synonyms:
(4Z)-2-benzyl-4-[4-(dimethylamino)benzylidene]-5-methyl-2-pyrazolin-3-one (4Z)-4-[[4-(dimethylamino)phenyl]methylidene]-5-methyl-2-(phenylmethyl)-3-pyrazolone 2-Benzyl-4-(4-dimethylamino-benzylidene)-5-methyl-2,4-dihydro-pyrazol-3-one SMR000174747 | cid_5404921
Type:
Small organic molecule
Emp. Form.:
C20H21N3O
Mol. Mass.:
319.4002
SMILES:
CN(C)c1ccc(C=c2c(=C)[nH]n(Cc3ccccc3)c2=O)cc1
: