Target
Alkaline phosphatase, germ cell type
Ligand
BDBM75760
Substrate
Meas. Tech.
Dose Response confirmation of uHTS inhibitors of Human Intestinal Alkaline Phosphatase using Placental Alkaline Phosphatase
IC50
27900±n/a nM
Citation
 PubChem, PC Dose Response confirmation of uHTS inhibitors of Human Intestinal Alkaline Phosphatase using Placental Alkaline Phosphatase PubChem Bioassay (2010)[AID] 
Target
Name:
Alkaline phosphatase, germ cell type
Synonyms:
ALPG ALPPL2 PPBN_HUMAN | placental-like alkaline phosphatase preproprotein
Type:
PROTEIN
Mol. Mass.:
57374.31
Organism:
Homo sapiens (Human)
Description:
ChEMBL_29964
Residue:
532
  
Inhibitor
Name:
BDBM75760
Synonyms:
4-(2-bromophenyl)azo-N,N-dimethylaniline 4-[(2-bromophenyl)diazenyl]-N,N-dimethylaniline SMR000588378 cid_4153146
Type:
Small organic molecule
Emp. Form.:
C14H14BrN3
Mol. Mass.:
304.185
SMILES:
CN(C)c1ccc(cc1)\N=N\c1ccccc1Br
: