Target
Caspase-3
Ligand
BDBM32085
Substrate
Meas. Tech.
Dose Response confirmation of inhibitors of Sentrin-specific proteases (SENPs) using a Caspase-3 Selectivity assay
IC50
69900±n/a nM
Citation
 PubChem, PC Dose Response confirmation of inhibitors of Sentrin-specific proteases (SENPs) using a Caspase-3 Selectivity assay PubChem Bioassay (2010)[AID] 
Target
Name:
Caspase-3
Synonyms:
Apopain CASP3 CPP-32 Caspase 3 Caspase-3 subunit p17 SCA-1 Yama protein | caspase-3 preproprotein
Type:
Hydrolase; heterotetramer of two heterodimers
Mol. Mass.:
31607.55
Organism:
Homo sapiens (Human)
Description:
Residue:
277
  
Inhibitor
Name:
BDBM32085
Synonyms:
MLS000085603 N-(2-hydroxy-1,3-dioxo-2,3-dihydro-1H-inden-2-yl)benzamide N-(2-hydroxy-1,3-dioxoinden-2-yl)benzamide SMR000020538 | cid_3237318
Type:
Small organic molecule
Emp. Form.:
C16H11NO4
Mol. Mass.:
281.2628
SMILES:
OC1(NC(=O)c2ccccc2)C(=O)c2ccccc2C1=O
: