Target
Caspase-3
Ligand
BDBM76398
Substrate
Meas. Tech.
Dose Response confirmation of inhibitors of Sentrin-specific proteases (SENPs) using a Caspase-3 Selectivity assay
IC50
3430±n/a nM
Citation
 PubChem, PC Dose Response confirmation of inhibitors of Sentrin-specific proteases (SENPs) using a Caspase-3 Selectivity assay PubChem Bioassay (2010)[AID] 
Target
Name:
Caspase-3
Synonyms:
Apopain CASP3 CPP-32 Caspase 3 Caspase-3 subunit p17 SCA-1 Yama protein | caspase-3 preproprotein
Type:
Hydrolase; heterotetramer of two heterodimers
Mol. Mass.:
31607.55
Organism:
Homo sapiens (Human)
Description:
Residue:
277
  
Inhibitor
Name:
BDBM76398
Synonyms:
3-methyl-N-[(E)-2-(3-methyl-4-nitro-1,2-oxazol-5-yl)ethenyl]aniline MLS000539442 SMR000125100 cid_5706876
Type:
Small organic molecule
Emp. Form.:
C13H13N3O3
Mol. Mass.:
259.2606
SMILES:
Cc1noc(CC=Nc2cccc(C)c2)c1[N+]([O-])=O
: