Target
Caspase-3
Ligand
BDBM76714
Substrate
Meas. Tech.
Dose Response confirmation of inhibitors of Sentrin-specific proteases (SENPs) using a Caspase-3 Selectivity assay
IC50
950±n/a nM
Citation
 PubChem, PC Dose Response confirmation of inhibitors of Sentrin-specific proteases (SENPs) using a Caspase-3 Selectivity assay PubChem Bioassay (2010)[AID] 
Target
Name:
Caspase-3
Synonyms:
Apopain CASP3 CPP-32 Caspase 3 Caspase-3 subunit p17 SCA-1 Yama protein | caspase-3 preproprotein
Type:
Hydrolase; heterotetramer of two heterodimers
Mol. Mass.:
31607.55
Organism:
Homo sapiens (Human)
Description:
Residue:
277
  
Inhibitor
Name:
BDBM76714
Synonyms:
3-(1H-benzimidazol-2-yl)-8-hydroxy-1-benzopyran-2-one 3-(1H-benzimidazol-2-yl)-8-hydroxy-coumarin 3-(1H-benzimidazol-2-yl)-8-oxidanyl-chromen-2-one SMR000559763 | cid_22424060
Type:
Small organic molecule
Emp. Form.:
C16H10N2O3
Mol. Mass.:
278.2622
SMILES:
Oc1cccc2cc(-c3nc4ccccc4[nH]3)c(=O)oc12
: