Target
Alkaline phosphatase, tissue-nonspecific isozyme
Ligand
BDBM34278
Substrate
Meas. Tech.
Dose Response confirmation of uHTS inhibitors of Mouse Intestinal Alkaline Phosphatase using Tissue Nonspecific Alkaline Phosphatase.
IC50
>100000±n/a nM
Citation
 PubChem, PC Dose Response confirmation of uHTS inhibitors of Mouse Intestinal Alkaline Phosphatase using Tissue Nonspecific Alkaline Phosphatase. PubChem Bioassay (2010)[AID] 
Target
Name:
Alkaline phosphatase, tissue-nonspecific isozyme
Synonyms:
ALPL tissue-nonspecific alkaline phosphatase precursor
Type:
PROTEIN
Mol. Mass.:
57306.17
Organism:
Homo sapiens (Human)
Description:
ChEMBL_1448917
Residue:
524
  
Inhibitor
Name:
BDBM34278
Synonyms:
1-(3,4-dihydroxyphenyl)-2-[[4-ethyl-5-(2-methoxyphenyl)-1,2,4-triazol-3-yl]sulfanyl]ethanone 1-[3,4-bis(oxidanyl)phenyl]-2-[[4-ethyl-5-(2-methoxyphenyl)-1,2,4-triazol-3-yl]sulfanyl]ethanone SMR000038049 | cid_665183
Type:
Small organic molecule
Emp. Form.:
C19H19N3O4S
Mol. Mass.:
385.437
SMILES:
CCn1c(SCC(=O)c2ccc(O)c(O)c2)nnc1-c1ccccc1OC
: