Target
Alkaline phosphatase, tissue-nonspecific isozyme
Ligand
BDBM50304
Substrate
Meas. Tech.
Dose Response confirmation of uHTS inhibitors of Mouse Intestinal Alkaline Phosphatase using Tissue Nonspecific Alkaline Phosphatase.
IC50
>100000±n/a nM
Citation
 PubChem, PC Dose Response confirmation of uHTS inhibitors of Mouse Intestinal Alkaline Phosphatase using Tissue Nonspecific Alkaline Phosphatase. PubChem Bioassay (2010)[AID] 
Target
Name:
Alkaline phosphatase, tissue-nonspecific isozyme
Synonyms:
ALPL tissue-nonspecific alkaline phosphatase precursor
Type:
PROTEIN
Mol. Mass.:
57306.17
Organism:
Homo sapiens (Human)
Description:
ChEMBL_1448917
Residue:
524
  
Inhibitor
Name:
BDBM50304
Synonyms:
MLS000720395 cid_15944832 sodium;2-nitro-4-(3-nitro-4-oxido-phenyl)sulfonyl-phenolate | sodium;2-nitro-4-(3-nitro-4-oxidophenyl)sulfonylphenolate
Type:
Small organic molecule
Emp. Form.:
C12H6N2O8S
Mol. Mass.:
338.251
SMILES:
[O-]c1ccc(cc1[N+]([O-])=O)S(=O)(=O)c1ccc([O-])c(c1)[N+]([O-])=O
: