Target
Alkaline phosphatase, tissue-nonspecific isozyme
Ligand
BDBM68124
Substrate
Meas. Tech.
Dose Response confirmation of uHTS inhibitors of Mouse Intestinal Alkaline Phosphatase using Tissue Nonspecific Alkaline Phosphatase.
IC50
>100000±n/a nM
Citation
 PubChem, PC Dose Response confirmation of uHTS inhibitors of Mouse Intestinal Alkaline Phosphatase using Tissue Nonspecific Alkaline Phosphatase. PubChem Bioassay (2010)[AID] 
Target
Name:
Alkaline phosphatase, tissue-nonspecific isozyme
Synonyms:
ALPL tissue-nonspecific alkaline phosphatase precursor
Type:
PROTEIN
Mol. Mass.:
57306.17
Organism:
Homo sapiens (Human)
Description:
ChEMBL_1448917
Residue:
524
  
Inhibitor
Name:
BDBM68124
Synonyms:
1-(9-benzyl-9-azabicyclo[3.3.1]nonan-3-yl)-3-[4-chloro-3-(trifluoromethyl)phenyl]urea 1-[4-chloro-3-(trifluoromethyl)phenyl]-3-[9-(phenylmethyl)-9-azabicyclo[3.3.1]nonan-3-yl]urea SMR000285473 | cid_3217186
Type:
Small organic molecule
Emp. Form.:
C23H25ClF3N3O
Mol. Mass.:
451.912
SMILES:
[H]C12CCCC([H])(CC(C1)NC(=O)Nc1ccc(Cl)c(c1)C(F)(F)F)N2Cc1ccccc1
: