Target
Alkaline phosphatase, tissue-nonspecific isozyme
Ligand
BDBM60675
Substrate
Meas. Tech.
Dose Response confirmation of uHTS inhibitors of Mouse Intestinal Alkaline Phosphatase using Tissue Nonspecific Alkaline Phosphatase.
IC50
>100000±n/a nM
Citation
 PubChem, PC Dose Response confirmation of uHTS inhibitors of Mouse Intestinal Alkaline Phosphatase using Tissue Nonspecific Alkaline Phosphatase. PubChem Bioassay (2010)[AID] 
Target
Name:
Alkaline phosphatase, tissue-nonspecific isozyme
Synonyms:
ALPL tissue-nonspecific alkaline phosphatase precursor
Type:
PROTEIN
Mol. Mass.:
57306.17
Organism:
Homo sapiens (Human)
Description:
ChEMBL_1448917
Residue:
524
  
Inhibitor
Name:
BDBM60675
Synonyms:
(5E)-2-amino-5-(2-furanylmethylidene)-4-thiazolone (5E)-2-amino-5-(furan-2-ylmethylidene)-1,3-thiazol-4-one MLS000709076 cid_1243441
Type:
Small organic molecule
Emp. Form.:
C8H6N2O2S
Mol. Mass.:
194.21
SMILES:
NC1=NC(=O)C(S1)=Cc1ccco1
: