Target
Alkaline phosphatase, tissue-nonspecific isozyme
Ligand
BDBM53139
Substrate
Meas. Tech.
Dose Response confirmation of uHTS inhibitors of Mouse Intestinal Alkaline Phosphatase using Tissue Nonspecific Alkaline Phosphatase.
IC50
45000±n/a nM
Citation
 PubChem, PC Dose Response confirmation of uHTS inhibitors of Mouse Intestinal Alkaline Phosphatase using Tissue Nonspecific Alkaline Phosphatase. PubChem Bioassay (2010)[AID] 
Target
Name:
Alkaline phosphatase, tissue-nonspecific isozyme
Synonyms:
ALPL tissue-nonspecific alkaline phosphatase precursor
Type:
PROTEIN
Mol. Mass.:
57306.17
Organism:
Homo sapiens (Human)
Description:
ChEMBL_1448917
Residue:
524
  
Inhibitor
Name:
BDBM53139
Synonyms:
4-[[(E)-3-(2-furyl)acryloyl]thiocarbamoylamino]benzoic acid 4-[[[[(E)-3-(2-furanyl)-1-oxoprop-2-enyl]amino]-sulfanylidenemethyl]amino]benzoic acid SMR000539235 | cid_947839
Type:
Small organic molecule
Emp. Form.:
C15H12N2O4S
Mol. Mass.:
316.332
SMILES:
OC(=O)c1ccc(NC(=S)NC(=O)C=Cc2ccco2)cc1
: