Target
Alkaline phosphatase, tissue-nonspecific isozyme
Ligand
BDBM76204
Substrate
Meas. Tech.
Dose Response confirmation of uHTS inhibitors of Mouse Intestinal Alkaline Phosphatase using Tissue Nonspecific Alkaline Phosphatase.
IC50
19600±n/a nM
Citation
 PubChem, PC Dose Response confirmation of uHTS inhibitors of Mouse Intestinal Alkaline Phosphatase using Tissue Nonspecific Alkaline Phosphatase. PubChem Bioassay (2010)[AID] 
Target
Name:
Alkaline phosphatase, tissue-nonspecific isozyme
Synonyms:
ALPL tissue-nonspecific alkaline phosphatase precursor
Type:
PROTEIN
Mol. Mass.:
57306.17
Organism:
Homo sapiens (Human)
Description:
ChEMBL_1448917
Residue:
524
  
Inhibitor
Name:
BDBM76204
Synonyms:
2-[3-[(5Z)-5-(2-furfurylidene)-4-keto-2-thioxo-thiazolidin-3-yl]propanoylamino]-5-hydroxy-benzoic acid 2-[3-[(5Z)-5-(furan-2-ylmethylidene)-4-oxo-2-sulfanylidene-1,3-thiazolidin-3-yl]propanoylamino]-5-hydroxybenzoic acid MLS001216164 cid_6226152
Type:
Small organic molecule
Emp. Form.:
C18H14N2O6S2
Mol. Mass.:
418.444
SMILES:
OC(=O)c1cc(O)ccc1NC(=O)CCN1C(=S)S\C(=C/c2ccco2)C1=O
: