Target
Alkaline phosphatase, tissue-nonspecific isozyme
Ligand
BDBM60955
Substrate
Meas. Tech.
Dose Response confirmation of uHTS inhibitors of Mouse Intestinal Alkaline Phosphatase using Tissue Nonspecific Alkaline Phosphatase.
IC50
>100000±n/a nM
Citation
 PubChem, PC Dose Response confirmation of uHTS inhibitors of Mouse Intestinal Alkaline Phosphatase using Tissue Nonspecific Alkaline Phosphatase. PubChem Bioassay (2010)[AID] 
Target
Name:
Alkaline phosphatase, tissue-nonspecific isozyme
Synonyms:
ALPL tissue-nonspecific alkaline phosphatase precursor
Type:
PROTEIN
Mol. Mass.:
57306.17
Organism:
Homo sapiens (Human)
Description:
ChEMBL_1448917
Residue:
524
  
Inhibitor
Name:
BDBM60955
Synonyms:
4-[2-[(5Z)-5-(furan-2-ylmethylidene)-4-oxidanylidene-2-sulfanylidene-1,3-thiazolidin-3-yl]ethanoylamino]-2-oxidanyl-benzoic acid 4-[[2-[(5Z)-5-(2-furfurylidene)-4-keto-2-thioxo-thiazolidin-3-yl]acetyl]amino]-2-hydroxy-benzoic acid MLS001157843 cid_6237926
Type:
Small organic molecule
Emp. Form.:
C17H12N2O6S2
Mol. Mass.:
404.417
SMILES:
OC(=O)c1ccc(NC(=O)CN2C(=S)S\C(=C/c3ccco3)C2=O)cc1O
: