Target
Sentrin-specific protease 8
Ligand
BDBM48039
Substrate
Meas. Tech.
Dose Response confirmation of inhibitors of Sentrin-specific proteases (SENPs) using a Luminescent Interference Counterscreen assay
IC50
>5000±0 nM
Citation
 PubChem, PC Dose Response confirmation of inhibitors of Sentrin-specific proteases (SENPs) using a Luminescent Interference Counterscreen assay PubChem Bioassay (2010)[AID] 
Target
Name:
Sentrin-specific protease 8
Synonyms:
DEN1 PRSC2 SENP8_HUMAN | SUMO/sentrin specific peptidase family member 8
Type:
Enzyme Catalytic Domain
Mol. Mass.:
24104.52
Organism:
Homo sapiens (Human)
Description:
gi_262118306
Residue:
212
  
Inhibitor
Name:
BDBM48039
Synonyms:
3-[[(4E)-4-(2,4-dimethylphenyl)sulfonylimino-1-keto-2-naphthyl]amino]benzoic acid 3-[[(4E)-4-(2,4-dimethylphenyl)sulfonylimino-1-oxo-2-naphthalenyl]amino]benzoic acid MLS000948061 cid_5824726
Type:
Small organic molecule
Emp. Form.:
C25H20N2O5S
Mol. Mass.:
460.502
SMILES:
Cc1ccc(c(C)c1)S(=O)(=O)N=C1C=C(Nc2cccc(c2)C(O)=O)C(=O)c2ccccc12
: