Target
Kappa-type opioid receptor
Ligand
BDBM71612
Substrate
Meas. Tech.
SAR analysis of Antagonists of the Kappa Opioid Receptor (KOR) using an Image-Based Assay - Set 4
IC50
45.1±n/a nM
Citation
 PubChem, PC SAR analysis of Antagonists of the Kappa Opioid Receptor (KOR) using an Image-Based Assay - Set 4 PubChem Bioassay (2010)[AID] 
Target
Name:
Kappa-type opioid receptor
Synonyms:
K-OR-1 Kappa-opioid receptor (KOR) Kappa-type opioid receptor (KOR) OPIATE Kappa OPRK1 kappa opioid receptor (KOR)
Type:
G Protein-Coupled Receptor (GPCR)
Mol. Mass.:
42648.76
Organism:
Homo sapiens (Human)
Description:
P41145
Residue:
380
  
Inhibitor
Name:
BDBM71612
Synonyms:
KSC-1-263 cid_44665685
Type:
Small organic molecule
Emp. Form.:
C27H30N6O4
Mol. Mass.:
502.5649
SMILES:
Cc1ccnc2n(CC(=O)NCCCN3CCN(CC3)c3ccc4OCOc4c3)c(=O)c3cccn3c12
: