Target
Kappa-type opioid receptor
Ligand
BDBM75567
Substrate
Meas. Tech.
SAR analysis of Antagonists of the Kappa Opioid Receptor (KOR) using an Image-Based Assay - Set 4
IC50
168±n/a nM
Citation
 PubChem, PC SAR analysis of Antagonists of the Kappa Opioid Receptor (KOR) using an Image-Based Assay - Set 4 PubChem Bioassay (2010)[AID] 
Target
Name:
Kappa-type opioid receptor
Synonyms:
K-OR-1 Kappa-opioid receptor (KOR) Kappa-type opioid receptor (KOR) OPIATE Kappa OPRK1 kappa opioid receptor (KOR)
Type:
G Protein-Coupled Receptor (GPCR)
Mol. Mass.:
42648.76
Organism:
Homo sapiens (Human)
Description:
P41145
Residue:
380
  
Inhibitor
Name:
BDBM75567
Synonyms:
4-[[(4-butylphenyl)sulfonylamino]methyl]-N-[2-[(phenylmethyl)-propan-2-yl-amino]ethyl]benzamide KSC-11-119-1 N-[2-[benzyl(isopropyl)amino]ethyl]-4-[[(4-butylphenyl)sulfonylamino]methyl]benzamide cid_45115593
Type:
Small organic molecule
Emp. Form.:
C30H39N3O3S
Mol. Mass.:
521.714
SMILES:
CCCCc1ccc(cc1)S(=O)(=O)NCc1ccc(cc1)C(=O)NCCN(Cc1ccccc1)C(C)C
: