Target
Kappa-type opioid receptor
Ligand
BDBM71610
Substrate
Meas. Tech.
SAR analysis of small molecule antagonists of the kappa opioid receptor via a luminescent beta-arrestin assay - Set 6
IC50
164±n/a nM
Citation
 PubChem, PC SAR analysis of small molecule antagonists of the kappa opioid receptor via a luminescent beta-arrestin assay - Set 6 PubChem Bioassay (2010)[AID] 
Target
Name:
Kappa-type opioid receptor
Synonyms:
K-OR-1 Kappa-opioid receptor (KOR) Kappa-type opioid receptor (KOR) OPIATE Kappa OPRK1 kappa opioid receptor (KOR)
Type:
G Protein-Coupled Receptor (GPCR)
Mol. Mass.:
42648.76
Organism:
Homo sapiens (Human)
Description:
P41145
Residue:
380
  
Inhibitor
Name:
BDBM71610
Synonyms:
KSC-1-256 ML190 | cid_44665680
Type:
Small organic molecule
Emp. Form.:
C27H32N6O3
Mol. Mass.:
488.5814
SMILES:
COc1ccc(cc1)N1CCN(CCCNC(=O)Cn2c3nccc(C)c3n3cccc3c2=O)CC1
: