Target
Kappa-type opioid receptor
Ligand
BDBM71622
Substrate
Meas. Tech.
SAR analysis of small molecule antagonists of the kappa opioid receptor via a luminescent beta-arrestin assay - Set 6
IC50
2420±n/a nM
Citation
 PubChem, PC SAR analysis of small molecule antagonists of the kappa opioid receptor via a luminescent beta-arrestin assay - Set 6 PubChem Bioassay (2010)[AID] 
Target
Name:
Kappa-type opioid receptor
Synonyms:
K-OR-1 Kappa-opioid receptor (KOR) Kappa-type opioid receptor (KOR) OPIATE Kappa OPRK1 kappa opioid receptor (KOR)
Type:
G Protein-Coupled Receptor (GPCR)
Mol. Mass.:
42648.76
Organism:
Homo sapiens (Human)
Description:
P41145
Residue:
380
  
Inhibitor
Name:
BDBM71622
Synonyms:
KSC-1-281 cid_45100476
Type:
Small organic molecule
Emp. Form.:
C26H27BrN6O4
Mol. Mass.:
567.434
SMILES:
Brc1cnc2n(CC(=O)NCCCN3CCN(CC3)c3ccc4OCOc4c3)c(=O)c3cccn3c2c1
: