Target
Voltage-dependent T-type calcium channel subunit alpha-1H
Ligand
BDBM77219
Substrate
Meas. Tech.
Inhibitors of T-Type Calcium Channel
EC50
5210±0 nM
Citation
 PubChem, PC Inhibitors of T-Type Calcium Channel PubChem Bioassay (2010)[AID] 
Target
Name:
Voltage-dependent T-type calcium channel subunit alpha-1H
Synonyms:
CAC1H_HUMAN Low-voltage-activated calcium channel alpha1 3.2 subunit Voltage-gated calcium channel voltage-dependent T-type calcium channel subunit alpha-1H isoform a
Type:
Enzyme Catalytic Domain
Mol. Mass.:
259187.68
Organism:
Homo sapiens (Human)
Description:
Calcium channel (Type T,L) 0 0::O95180
Residue:
2353
  
Inhibitor
Name:
BDBM77219
Synonyms:
1-[4-(4-fluorophenyl)-1-piperazinyl]-3-[3-(4-fluorophenyl)-2,5,7-trimethyl-6-pyrazolo[1,5-a]pyrimidinyl]-1-propanone 1-[4-(4-fluorophenyl)piperazin-1-yl]-3-[3-(4-fluorophenyl)-2,5,7-trimethylpyrazolo[1,5-a]pyrimidin-6-yl]propan-1-one MLS000522531 cid_9550468
Type:
Small organic molecule
Emp. Form.:
C28H29F2N5O
Mol. Mass.:
489.5596
SMILES:
Cc1nn2c(C)c(CCC(=O)N3CCN(CC3)c3ccc(F)cc3)c(C)nc2c1-c1ccc(F)cc1
: