Target
Protein RecA
Ligand
BDBM63026
Substrate
Meas. Tech.
Intein inhibitors as potential Tuberculosis drugs
IC50
1910±n/a nM
Citation
 PubChem, PC Intein inhibitors as potential Tuberculosis drugs PubChem Bioassay (2010)[AID] 
Target
Name:
Protein RecA
Synonyms:
DNA recombination protein RecA recA
Type:
Enzyme Catalytic Domain
Mol. Mass.:
85386.52
Organism:
Mycobacterium tuberculosis H37Rv
Description:
gi_15609874
Residue:
790
  
Inhibitor
Name:
BDBM63026
Synonyms:
2-Chloro-N-(4-chloro-phenyl)-N-(1H-indol-3-yl)-acetamide 2-chloro-N-(4-chlorophenyl)-N-(1H-indol-3-yl)acetamide SMR000148458 | cid_818737
Type:
Small organic molecule
Emp. Form.:
C16H12Cl2N2O
Mol. Mass.:
319.185
SMILES:
ClCC(=O)N(c1c[nH]c2ccccc12)c1ccc(Cl)cc1
: